Target
1,5-anhydro-D-fructose reductase
Ligand
BDBM269340
Substrate
Meas. Tech.
Fatty Acid Synthase Keto-reductase Domain (FASN KR) Inhibition
pH
7.5±n/a
Temperature
298.15±n/a K
IC50
158±n/a nM
Comments
extracted
Citation
 Connolly, PJLu, T Imidazolin-5-one derivative useful as FASN inhibitors for the treatment of cancer US Patent  US9718813 Publication Date 8/1/2017 
Target
Name:
1,5-anhydro-D-fructose reductase
Synonyms:
AF reductase AKR1CL2 AKRDC1 Aldo-keto reductase family 1 member E2 | LoopADR
Type:
Enzyme Catalytic Domain
Mol. Mass.:
36595.42
Organism:
Homo sapiens (Human)
Description:
Q96JD6
Residue:
320
  
Inhibitor
Name:
BDBM269340
Synonyms:
(R)-4,4-dimethyl-2-(2-methyl-4-(1-methyl-1H-benzo[d]imidazol-5-yl)phenyl)-1-((1-(1-methylcyclopropanecarbonyl)pyrrolidin-3-yl)methyl)-1H-imidazol-5(4H)-one US9718813, Compound 85
Type:
Small organic molecule
Emp. Form.:
C30H35N5O2
Mol. Mass.:
497.6312
SMILES:
Cc1cc(ccc1C1=NC(C)(C)C(=O)N1C[C@@H]1CCN(C1)C(=O)C1(C)CC1)-c1ccc2n(C)cnc2c1
: