Target
NADPH oxidase 1
Ligand
BDBM65847
Substrate
Meas. Tech.
Late-stage luminescence-based cell-based dose response assay to identify inhibitors of NADPH oxidase 1 (NOX1): Synthesized analogs
IC50
>50000±n/a nM
Citation
 PubChem, PC Late-stage luminescence-based cell-based dose response assay to identify inhibitors of NADPH oxidase 1 (NOX1): Synthesized analogs PubChem Bioassay (2010)[AID] 
Target
Name:
NADPH oxidase 1
Synonyms:
MOX-1 Mitogenic oxidase 1 NOH-1 NOX-1 NOX1_HUMAN
Type:
PROTEIN
Mol. Mass.:
64890.44
Organism:
Homo sapiens (Human)
Description:
ChEMBL_792877
Residue:
564
  
Inhibitor
Name:
BDBM65847
Synonyms:
10H-phenothiazine 5,5-dioxide SR-01000393539-5 | cid_71024
Type:
Small organic molecule
Emp. Form.:
C12H9NO2S
Mol. Mass.:
231.27
SMILES:
O=S1(=O)c2ccccc2Nc2ccccc12
: