Target
NADPH oxidase 1
Ligand
BDBM50672
Substrate
Meas. Tech.
Late-stage luminescence-based cell-based dose response assay to identify inhibitors of NADPH oxidase 1 (NOX1): Synthesized analogs
IC50
305±n/a nM
Citation
 PubChem, PC Late-stage luminescence-based cell-based dose response assay to identify inhibitors of NADPH oxidase 1 (NOX1): Synthesized analogs PubChem Bioassay (2010)[AID] 
Target
Name:
NADPH oxidase 1
Synonyms:
MOX-1 Mitogenic oxidase 1 NOH-1 NOX-1 NOX1_HUMAN
Type:
PROTEIN
Mol. Mass.:
64890.44
Organism:
Homo sapiens (Human)
Description:
ChEMBL_792877
Residue:
564
  
Inhibitor
Name:
BDBM50672
Synonyms:
3-[2-[1-(10H-phenothiazin-2-yl)ethylidene]hydrazinyl]benzoic acid MLS000775187 cid_4403483
Type:
Small organic molecule
Emp. Form.:
C21H17N3O2S
Mol. Mass.:
375.444
SMILES:
CC(N=Nc1cccc(c1)C(O)=O)c1ccc2Sc3ccccc3Nc2c1
: