Target
Tyrosine-protein phosphatase non-receptor type 22
Ligand
BDBM65970
Substrate
Meas. Tech.
SAR LYP1 Fluorescent Assay using OMFP substrate for In Vitro dose response studies - Set 2
IC50
>100000±n/a nM
Citation
 PubChem, PC SAR LYP1 Fluorescent Assay using OMFP substrate for In Vitro dose response studies - Set 2 PubChem Bioassay (2010)[AID] 
Target
Name:
Tyrosine-protein phosphatase non-receptor type 22
Synonyms:
3.1.3.48 LyP Lymphoid phosphatase (Lyp) PEST-domain phosphatase PTPN22 Tyrosine-protein phosphatase non-receptor type 22 (LYP) | tyrosine-protein phosphatase non-receptor type 22 isoform 1
Type:
Mol. Mass.:
91712.31
Organism:
Homo sapiens (Human)
Description:
Q9Y2R2
Residue:
807
  
Inhibitor
Name:
BDBM65970
Synonyms:
2-[4-[[[3-[(2-methoxyphenyl)sulfamoyl]benzoyl]hydrazinylidene]methyl]phenoxy]acetic acid 2-[4-[[[3-[(2-methoxyphenyl)sulfamoyl]phenyl]carbonylhydrazinylidene]methyl]phenoxy]ethanoic acid MLS-0256798.0001 | cid_2127695
Type:
Small organic molecule
Emp. Form.:
C23H21N3O7S
Mol. Mass.:
483.494
SMILES:
COc1ccccc1NS(=O)(=O)c1cccc(c1)C(=O)NN=Cc1ccc(OCC(O)=O)cc1
: