Target
Tyrosine-protein phosphatase non-receptor type 22
Ligand
BDBM65974
Substrate
Meas. Tech.
SAR LYP1 Fluorescent Assay using OMFP substrate for In Vitro dose response studies - Set 2
IC50
4040±n/a nM
Citation
 PubChem, PC SAR LYP1 Fluorescent Assay using OMFP substrate for In Vitro dose response studies - Set 2 PubChem Bioassay (2010)[AID] 
Target
Name:
Tyrosine-protein phosphatase non-receptor type 22
Synonyms:
3.1.3.48 LyP Lymphoid phosphatase (Lyp) PEST-domain phosphatase PTPN22 Tyrosine-protein phosphatase non-receptor type 22 (LYP) | tyrosine-protein phosphatase non-receptor type 22 isoform 1
Type:
Mol. Mass.:
91712.31
Organism:
Homo sapiens (Human)
Description:
Q9Y2R2
Residue:
807
  
Inhibitor
Name:
BDBM65974
Synonyms:
3-[(5E)-5-[4-(4-chlorobenzyl)oxy-3-methoxy-benzylidene]-4-keto-2-thioxo-thiazolidin-3-yl]benzoic acid 3-[(5E)-5-[[4-[(4-chlorophenyl)methoxy]-3-methoxyphenyl]methylidene]-4-oxo-2-sulfanylidene-1,3-thiazolidin-3-yl]benzoic acid MLS-0435625.0001 | cid_16466007
Type:
Small organic molecule
Emp. Form.:
C25H18ClNO5S2
Mol. Mass.:
511.997
SMILES:
COc1cc(\C=C2\SC(=S)N(C2=O)c2cccc(c2)C(O)=O)ccc1OCc1ccc(Cl)cc1
: