Target
60S ribosomal protein L19-A
Ligand
BDBM61009
Substrate
Meas. Tech.
Dose Response of TOR pathway GFP-fusion proteins in Saccharomyes cerevisiae specifically RPL19A based on MLPCN hits
EC50
3623±n/a nM
Citation
 PubChem, PC Dose Response of TOR pathway GFP-fusion proteins in Saccharomyes cerevisiae specifically RPL19A based on MLPCN hits PubChem Bioassay (2010)[AID] 
Target
Name:
60S ribosomal protein L19-A
Synonyms:
RL19A_YEAST RPL23A | YL14A
Type:
Enzyme Catalytic Domain
Mol. Mass.:
21739.62
Organism:
Saccharomyces cerevisiae
Description:
gi_536029
Residue:
189
  
Inhibitor
Name:
BDBM61009
Synonyms:
(1aS,3aS,6aS,6bR)-5,5,6b-trimethyl-3a,4,6,6a-tetrahydro-1H-cycloprop[e]indene-1a,2-dicarbaldehyde (1aS,3aS,6aS,6bR)-5,5,6b-trimethyl-3a,4,6,6a-tetrahydro-1H-cyclopropa[e]indene-1a,2-dicarboxaldehyde Isovelleral SMR000127505 marasmane
Type:
Small organic molecule
Emp. Form.:
C15H20O2
Mol. Mass.:
232.3181
SMILES:
C[C@]12C[C@@]1(C=O)C(C=O)=C[C@@H]1CC(C)(C)C[C@H]21
: