Target
60S ribosomal protein L19-A
Ligand
BDBM65994
Substrate
Meas. Tech.
Dose Response of TOR pathway GFP-fusion proteins in Saccharomyes cerevisiae specifically RPL19A based on MLPCN hits
EC50
>33000±n/a nM
Citation
 PubChem, PC Dose Response of TOR pathway GFP-fusion proteins in Saccharomyes cerevisiae specifically RPL19A based on MLPCN hits PubChem Bioassay (2010)[AID] 
Target
Name:
60S ribosomal protein L19-A
Synonyms:
RL19A_YEAST RPL23A | YL14A
Type:
Enzyme Catalytic Domain
Mol. Mass.:
21739.62
Organism:
Saccharomyces cerevisiae
Description:
gi_536029
Residue:
189
  
Inhibitor
Name:
BDBM65994
Synonyms:
4-amino-3-[2-[(E)-(3-bromo-6-oxocyclohexa-2,4-dien-1-ylidene)methyl]hydrazinyl]-6-tert-butyl-1,2,4-triazin-5-one 4-amino-3-[[(E)-(3-bromo-6-oxo-1-cyclohexa-2,4-dienylidene)methyl]hydrazo]-6-tert-butyl-1,2,4-triazin-5-one MLS000697044 cid_6289422
Type:
Small organic molecule
Emp. Form.:
C14H17BrN6O2
Mol. Mass.:
381.228
SMILES:
CC(C)(C)c1nnc(N=NCc2cc(Br)ccc2O)n(N)c1=O
: