Target
60S ribosomal protein L19-A
Ligand
BDBM65422
Substrate
Meas. Tech.
Dose Response of TOR pathway GFP-fusion proteins in Saccharomyes cerevisiae specifically RPL19A based on MLPCN hits
EC50
6065±n/a nM
Citation
 PubChem, PC Dose Response of TOR pathway GFP-fusion proteins in Saccharomyes cerevisiae specifically RPL19A based on MLPCN hits PubChem Bioassay (2010)[AID] 
Target
Name:
60S ribosomal protein L19-A
Synonyms:
RL19A_YEAST RPL23A | YL14A
Type:
Enzyme Catalytic Domain
Mol. Mass.:
21739.62
Organism:
Saccharomyces cerevisiae
Description:
gi_536029
Residue:
189
  
Inhibitor
Name:
BDBM65422
Synonyms:
MLS000721672 N-[1-tert-butyl-3-(4-chlorophenyl)-4-pyrazolo[3,4-d]pyrimidinyl]acetamide N-[1-tert-butyl-3-(4-chlorophenyl)pyrazolo[3,4-d]pyrimidin-4-yl]ethanamide cid_1471842
Type:
Small organic molecule
Emp. Form.:
C17H18ClN5O
Mol. Mass.:
343.811
SMILES:
CC(=O)Nc1ncnc2n(nc(-c3ccc(Cl)cc3)c12)C(C)(C)C
: