Target
60S ribosomal protein L19-A
Ligand
BDBM66010
Substrate
Meas. Tech.
Dose Response of TOR pathway GFP-fusion proteins in Saccharomyes cerevisiae specifically RPL19A based on MLPCN hits
EC50
7456±n/a nM
Citation
 PubChem, PC Dose Response of TOR pathway GFP-fusion proteins in Saccharomyes cerevisiae specifically RPL19A based on MLPCN hits PubChem Bioassay (2010)[AID] 
Target
Name:
60S ribosomal protein L19-A
Synonyms:
RL19A_YEAST RPL23A | YL14A
Type:
Enzyme Catalytic Domain
Mol. Mass.:
21739.62
Organism:
Saccharomyces cerevisiae
Description:
gi_536029
Residue:
189
  
Inhibitor
Name:
BDBM66010
Synonyms:
4-N-(3-fluorophenyl)-2-N-methyl-5-nitropyrimidine-2,4,6-triamine N'-(3-Fluoro-phenyl)-N-methyl-5-nitro-pyrimidine-2,4,6-triamine N4-(3-fluorophenyl)-N2-methyl-5-nitropyrimidine-2,4,6-triamine [4-amino-6-(3-fluoroanilino)-5-nitro-pyrimidin-2-yl]-methyl-amine | cid_3528206
Type:
Small organic molecule
Emp. Form.:
C11H11FN6O2
Mol. Mass.:
278.2424
SMILES:
CNc1nc(N)c(c(Nc2cccc(F)c2)n1)[N+]([O-])=O
: