Target
60S ribosomal protein L19-A
Ligand
BDBM66021
Substrate
Meas. Tech.
Dose Response of TOR pathway GFP-fusion proteins in Saccharomyes cerevisiae specifically RPL19A based on MLPCN hits
EC50
10010±n/a nM
Citation
 PubChem, PC Dose Response of TOR pathway GFP-fusion proteins in Saccharomyes cerevisiae specifically RPL19A based on MLPCN hits PubChem Bioassay (2010)[AID] 
Target
Name:
60S ribosomal protein L19-A
Synonyms:
RL19A_YEAST RPL23A | YL14A
Type:
Enzyme Catalytic Domain
Mol. Mass.:
21739.62
Organism:
Saccharomyces cerevisiae
Description:
gi_536029
Residue:
189
  
Inhibitor
Name:
BDBM66021
Synonyms:
MLS002153617 SMR001230885 | cid_24978571
Type:
Small organic molecule
Emp. Form.:
C65H114N20O8
Mol. Mass.:
1303.7299
SMILES:
[#6]-[#6]-[#6@H](-[#6])-[#6]-c1cn(nn1)-[#6@@H](-[#6]-[#6]-[#6]\[#7]=[#6](\[#7])-[#7])-[#6](=O)-[#7]-[#6]-[#6]-[#6]-[#6]-[#6]-[#6]-[#6]-[#6]-[#6]-[#6]-[#6](=O)-[#7]-1-[#6]-[#6]-[#7](-[#6]-[#6]-1)-c1nc(-[#7]-[#6]-[#6]-[#8]-[#6]-[#6]-[#8]-[#6]-[#6]-[#8]-[#6]C#C)nc(n1)-[#7]-1-[#6]-[#6]-[#7](-[#6]-[#6]-1)-[#6](=O)-[#6]-[#6]-[#6]-[#6]-[#6]-[#6]-[#6]-[#6]-[#6]-[#6]-[#7]-[#6](=O)-[#6@H](-[#6]-[#6]-[#6]-[#6]-[#7])-n1cc(-[#6]-[#6]-[#8])nn1
: