Target
General amino acid permease AGP1
Ligand
BDBM66028
Substrate
Meas. Tech.
Dose Response of TOR pathway GFP-fusion proteins in Saccharomyes cerevisiae specifically AGP1 based on MLPCN hits
EC50
7215±n/a nM
Citation
 PubChem, PC Dose Response of TOR pathway GFP-fusion proteins in Saccharomyes cerevisiae specifically AGP1 based on MLPCN hits PubChem Bioassay (2010)[AID] 
Target
Name:
General amino acid permease AGP1
Synonyms:
AGP1 Agp1p
Type:
Enzyme Catalytic Domain
Mol. Mass.:
69674.09
Organism:
Saccharomyces cerevisiae S288c
Description:
gi_85666113
Residue:
633
  
Inhibitor
Name:
BDBM66028
Synonyms:
(7-chloranylquinolin-4-yl) N,N-diethylcarbamate MLS000707856 N,N-diethylcarbamic acid (7-chloro-4-quinolyl) ester cid_749785
Type:
Small organic molecule
Emp. Form.:
C14H15ClN2O2
Mol. Mass.:
278.734
SMILES:
CCN(CC)C(=O)Oc1ccnc2cc(Cl)ccc12
: