Target
Citrate synthase, peroxisomal [1-24]
Ligand
BDBM65989
Substrate
Meas. Tech.
Dose Response of TOR pathway GFP-fusion proteins in Saccharomyes cerevisiae specifically CIT2 based on MLPCN hits
EC50
1479±n/a nM
Citation
 PubChem, PC Dose Response of TOR pathway GFP-fusion proteins in Saccharomyes cerevisiae specifically CIT2 based on MLPCN hits PubChem Bioassay (2010)[AID] 
Target
Name:
Citrate synthase, peroxisomal [1-24]
Synonyms:
CISY2_YEAST citrate synthase 2
Type:
Enzyme Catalytic Domain
Mol. Mass.:
2731.97
Organism:
Saccharomyces cerevisiae
Description:
gi_171229
Residue:
24
  
Inhibitor
Name:
BDBM65989
Synonyms:
2-thiophenecarboxylic acid [(Z)-[1-amino-2-(2,4-dichlorophenyl)ethylidene]amino] ester SMR000176881 [(Z)-[1-azanyl-2-(2,4-dichlorophenyl)ethylidene]amino] thiophene-2-carboxylate thiophene-2-carboxylic acid [(Z)-[1-amino-2-(2,4-dichlorophenyl)ethylidene]amino] ester
Type:
Small organic molecule
Emp. Form.:
C13H10Cl2N2O2S
Mol. Mass.:
329.202
SMILES:
Clc1ccc(CC(=N)NOC(=O)c2cccs2)c(Cl)c1
: