Target
Vacuolar aminopeptidase 1
Ligand
BDBM54724
Substrate
Meas. Tech.
Dose Response of TOR pathway GFP-fusion proteins in Saccharomyes cerevisiae specifically LAP4 based on MLPCN hits
EC50
1621±n/a nM
Citation
 PubChem, PC Dose Response of TOR pathway GFP-fusion proteins in Saccharomyes cerevisiae specifically LAP4 based on MLPCN hits PubChem Bioassay (2010)[AID] 
Target
Name:
Vacuolar aminopeptidase 1
Synonyms:
AMPL_YEAST API YSC1
Type:
Enzyme Catalytic Domain
Mol. Mass.:
57084.90
Organism:
Saccharomyces cerevisiae
Description:
gi_486173
Residue:
514
  
Inhibitor
Name:
BDBM54724
Synonyms:
1-anilino-3-phenyl-1H-pyrrole-2,5-dione 1-anilino-3-phenylpyrrole-2,5-dione MLS000540410 cid_1484338
Type:
Small organic molecule
Emp. Form.:
C16H12N2O2
Mol. Mass.:
264.2787
SMILES:
O=C1C=C(C(=O)N1Nc1ccccc1)c1ccccc1
: