Target
Vacuolar aminopeptidase 1
Ligand
BDBM54728
Substrate
Meas. Tech.
Dose Response of TOR pathway GFP-fusion proteins in Saccharomyes cerevisiae specifically LAP4 based on MLPCN hits
EC50
11230±n/a nM
Citation
 PubChem, PC Dose Response of TOR pathway GFP-fusion proteins in Saccharomyes cerevisiae specifically LAP4 based on MLPCN hits PubChem Bioassay (2010)[AID] 
Target
Name:
Vacuolar aminopeptidase 1
Synonyms:
AMPL_YEAST API YSC1
Type:
Enzyme Catalytic Domain
Mol. Mass.:
57084.90
Organism:
Saccharomyces cerevisiae
Description:
gi_486173
Residue:
514
  
Inhibitor
Name:
BDBM54728
Synonyms:
(5E)-1-phenyl-5-[(5-phenylsulfanylfuran-2-yl)methylidene]-1,3-diazinane-2,4,6-trione (5E)-1-phenyl-5-[[5-(phenylthio)-2-furyl]methylene]barbituric acid MLS000571977 cid_2265956
Type:
Small organic molecule
Emp. Form.:
C21H14N2O4S
Mol. Mass.:
390.412
SMILES:
O=C1NC(=O)C(=Cc2ccc(Sc3ccccc3)o2)C(=O)N1c1ccccc1
: