Target
Vacuolar aminopeptidase 1
Ligand
BDBM33174
Substrate
Meas. Tech.
Dose Response of TOR pathway GFP-fusion proteins in Saccharomyes cerevisiae specifically LAP4 based on MLPCN hits
EC50
15040±n/a nM
Citation
 PubChem, PC Dose Response of TOR pathway GFP-fusion proteins in Saccharomyes cerevisiae specifically LAP4 based on MLPCN hits PubChem Bioassay (2010)[AID] 
Target
Name:
Vacuolar aminopeptidase 1
Synonyms:
AMPL_YEAST API YSC1
Type:
Enzyme Catalytic Domain
Mol. Mass.:
57084.90
Organism:
Saccharomyces cerevisiae
Description:
gi_486173
Residue:
514
  
Inhibitor
Name:
BDBM33174
Synonyms:
2-[[(5Z)-5-(4-bromobenzylidene)-4-keto-2-thiazolin-2-yl]thio]acetic acid ethyl ester MLS000718201 cid_5440098 ethyl 2-[[(5Z)-5-[(4-bromophenyl)methylidene]-4-oxo-1,3-thiazol-2-yl]sulfanyl]acetate
Type:
Small organic molecule
Emp. Form.:
C14H12BrNO3S2
Mol. Mass.:
386.284
SMILES:
CCOC(=O)CSC1=NC(=O)\C(S1)=C\c1ccc(Br)cc1
: