Target
Beta-lactamase
Ligand
BDBM66103
Substrate
Meas. Tech.
Epi-absorbance-based dose response assay for common IMP-1 and VIM-2 inhibitors: biochemical high throughput counterscreen to identify inhibitors of TEM-1 metallo-beta-lactamase
IC50
>59640±n/a nM
Citation
 PubChem, PC Epi-absorbance-based dose response assay for common IMP-1 and VIM-2 inhibitors: biochemical high throughput counterscreen to identify inhibitors of TEM-1 metallo-beta-lactamase PubChem Bioassay (2010)[AID] 
Target
Name:
Beta-lactamase
Synonyms:
Type:
Enzyme Catalytic Domain
Mol. Mass.:
29494.42
Organism:
Salmonella enterica subsp. enterica serovar Choleraesuis str. SC-B67
Description:
gi_60115532
Residue:
269
  
Inhibitor
Name:
BDBM66103
Synonyms:
MLS000077039 N-(2,4-diketo-3-phenyl-thiazolidin-5-yl)-N-(m-tolyl)acetamide N-(2,4-dioxo-3-phenyl-5-thiazolidinyl)-N-(3-methylphenyl)acetamide SMR000009688 | cid_649976
Type:
Small organic molecule
Emp. Form.:
C18H16N2O3S
Mol. Mass.:
340.396
SMILES:
CC(=O)N(c1sc(=O)n(c1O)-c1ccccc1)c1cccc(C)c1
: