Target
Beta-lactamase
Ligand
BDBM39880
Substrate
Meas. Tech.
Epi-absorbance-based dose response assay for common IMP-1 and VIM-2 inhibitors: biochemical high throughput counterscreen to identify inhibitors of TEM-1 metallo-beta-lactamase
IC50
3646±n/a nM
Citation
 PubChem, PC Epi-absorbance-based dose response assay for common IMP-1 and VIM-2 inhibitors: biochemical high throughput counterscreen to identify inhibitors of TEM-1 metallo-beta-lactamase PubChem Bioassay (2010)[AID] 
Target
Name:
Beta-lactamase
Synonyms:
Type:
Enzyme Catalytic Domain
Mol. Mass.:
29494.42
Organism:
Salmonella enterica subsp. enterica serovar Choleraesuis str. SC-B67
Description:
gi_60115532
Residue:
269
  
Inhibitor
Name:
BDBM39880
Synonyms:
1-(ethylamino)-3-methyl-3H-naphtho[1,2,3-de]quinoline-2,7-dione SMR000020347 | cid_712714
Type:
Small organic molecule
Emp. Form.:
C19H16N2O2
Mol. Mass.:
304.3425
SMILES:
CCNc1c2-c3ccccc3C(=O)c3cccc(n(C)c1=O)c23
: