Target
Beta-lactamase
Ligand
BDBM54993
Substrate
Meas. Tech.
Epi-absorbance-based dose response assay for common IMP-1 and VIM-2 inhibitors: biochemical high throughput counterscreen to identify inhibitors of TEM-1 metallo-beta-lactamase
IC50
>59640±n/a nM
Citation
 PubChem, PC Epi-absorbance-based dose response assay for common IMP-1 and VIM-2 inhibitors: biochemical high throughput counterscreen to identify inhibitors of TEM-1 metallo-beta-lactamase PubChem Bioassay (2010)[AID] 
Target
Name:
Beta-lactamase
Synonyms:
Type:
Enzyme Catalytic Domain
Mol. Mass.:
29494.42
Organism:
Salmonella enterica subsp. enterica serovar Choleraesuis str. SC-B67
Description:
gi_60115532
Residue:
269
  
Inhibitor
Name:
BDBM54993
Synonyms:
4-[6-(diethylamino)-3-(diethyliminio)-3H-xanthen-9-yl]benzene-1,3-disulfonate SMR000554424 sodium;4-[3-(diethylamino)-6-diethylazaniumylidene-xanthen-9-yl]benzene-1,3-disulfonate sodium;4-[3-(diethylamino)-6-diethyliminio-9-xanthenyl]benzene-1,3-disulfonate | sodium;4-[3-(diethylamino)-6-diethyliminio-xanthen-9-yl]benzene-1,3-disulfonate
Type:
Small organic molecule
Emp. Form.:
C27H29N2O7S2
Mol. Mass.:
557.659
SMILES:
CCN(CC)c1ccc2c(-c3ccc(cc3S([O-])(=O)=O)S([O-])(=O)=O)c3ccc(cc3oc2c1)=[N+](CC)CC
: