Target
Beta-lactamase
Ligand
BDBM66132
Substrate
Meas. Tech.
Epi-absorbance-based dose response assay for common IMP-1 and VIM-2 inhibitors: biochemical high throughput screening assay to identify inhibitors of IMP-1metallo-beta-lactamase
IC50
35130±n/a nM
Citation
 PubChem, PC Epi-absorbance-based dose response assay for common IMP-1 and VIM-2 inhibitors: biochemical high throughput screening assay to identify inhibitors of IMP-1metallo-beta-lactamase PubChem Bioassay (2010)[AID] 
Target
Name:
Beta-lactamase
Synonyms:
Beta-lactamase | metallo-beta-lactamase IMP-1
Type:
Enzyme Catalytic Domain
Mol. Mass.:
27125.88
Organism:
Pseudomonas aeruginosa
Description:
gi_27368096
Residue:
246
  
Inhibitor
Name:
BDBM66132
Synonyms:
5-(4-tert-butylphenyl)-1,3-dihydropyrrolo[1,2-c][1,3]thiazole-6,7-dicarboxylic acid 5-[4-(tert-butyl)phenyl]-1H-pyrrolo[1,2-c][1,3]thiazole-6,7-dicarboxylic acid SMR000550604 | cid_1472061
Type:
Small organic molecule
Emp. Form.:
C18H19NO4S
Mol. Mass.:
345.413
SMILES:
CC(C)(C)c1ccc(cc1)-c1c(C(O)=O)c(C(O)=O)c2CSCn12
: