Target
Photoreceptor-specific nuclear receptor
Ligand
BDBM66173
Substrate
Meas. Tech.
TR-FRET-based biochemical high throughput dose response assay for agonists of nuclear receptor subfamily 2, group E, member 3 (NR2E3)
IC50
>39841±n/a nM
Citation
 PubChem, PC TR-FRET-based biochemical high throughput dose response assay for agonists of nuclear receptor subfamily 2, group E, member 3 (NR2E3) PubChem Bioassay (2010)[AID] 
Target
Name:
Photoreceptor-specific nuclear receptor
Synonyms:
NR2E3 PNR photoreceptor-specific nuclear receptor
Type:
PROTEIN
Mol. Mass.:
44699.83
Organism:
Homo sapiens (Human)
Description:
ChEMBL_401901
Residue:
410
  
Inhibitor
Name:
BDBM66173
Synonyms:
MLS000666816 N-(5-bromo-2-pyridinyl)-2-[2-(2,6-dimethylanilino)-2-oxoethoxy]benzamide N-(5-bromo-2-pyridyl)-2-[2-(2,6-dimethylanilino)-2-keto-ethoxy]benzamide SMR000271402 | cid_1329083
Type:
Small organic molecule
Emp. Form.:
C22H20BrN3O3
Mol. Mass.:
454.317
SMILES:
Cc1cccc(C)c1NC(=O)COc1ccccc1C(=O)Nc1ccc(Br)cn1
: