Target
Photoreceptor-specific nuclear receptor
Ligand
BDBM66185
Substrate
Meas. Tech.
TR-FRET-based biochemical high throughput dose response assay for agonists of nuclear receptor subfamily 2, group E, member 3 (NR2E3)
IC50
>39841±n/a nM
Citation
 PubChem, PC TR-FRET-based biochemical high throughput dose response assay for agonists of nuclear receptor subfamily 2, group E, member 3 (NR2E3) PubChem Bioassay (2010)[AID] 
Target
Name:
Photoreceptor-specific nuclear receptor
Synonyms:
NR2E3 PNR photoreceptor-specific nuclear receptor
Type:
PROTEIN
Mol. Mass.:
44699.83
Organism:
Homo sapiens (Human)
Description:
ChEMBL_401901
Residue:
410
  
Inhibitor
Name:
BDBM66185
Synonyms:
5-isopropyl-2-thioxo-2,3,5,6-tetrahydrobenzo[h]quinazolin-4(1H)-one 5-propan-2-yl-2-sulfanylidene-5,6-dihydro-1H-benzo[h]quinazolin-4-one SMR000473141 | cid_2835304
Type:
Small organic molecule
Emp. Form.:
C15H16N2OS
Mol. Mass.:
272.365
SMILES:
CC(C)C1Cc2ccccc2-c2[nH]c(=S)[nH]c(=O)c12
: