Target
Photoreceptor-specific nuclear receptor
Ligand
BDBM66197
Substrate
Meas. Tech.
TR-FRET-based biochemical high throughput dose response assay for agonists of nuclear receptor subfamily 2, group E, member 3 (NR2E3)
IC50
>39841±n/a nM
Citation
 PubChem, PC TR-FRET-based biochemical high throughput dose response assay for agonists of nuclear receptor subfamily 2, group E, member 3 (NR2E3) PubChem Bioassay (2010)[AID] 
Target
Name:
Photoreceptor-specific nuclear receptor
Synonyms:
NR2E3 PNR photoreceptor-specific nuclear receptor
Type:
PROTEIN
Mol. Mass.:
44699.83
Organism:
Homo sapiens (Human)
Description:
ChEMBL_401901
Residue:
410
  
Inhibitor
Name:
BDBM66197
Synonyms:
(4Z)-4-[1,3-benzodioxol-5-yl(hydroxy)methylene]-5-(3-methoxyphenyl)-1-(2-morpholinoethyl)pyrrolidine-2,3-quinone (4Z)-4-[1,3-benzodioxol-5-yl(hydroxy)methylidene]-5-(3-methoxyphenyl)-1-[2-(4-morpholinyl)ethyl]pyrrolidine-2,3-dione MLS001034252 cid_6149758
Type:
Small organic molecule
Emp. Form.:
C25H26N2O7
Mol. Mass.:
466.4831
SMILES:
COc1cccc(c1)C1C(C(=O)c2ccc3OCOc3c2)C(=O)C(=O)N1CCN1CCOCC1
: