Target
Isoform 2 of Nuclear receptor corepressor 2 (TRAC-1)
Ligand
BDBM44792
Substrate
Meas. Tech.
Counterscreen for agonists of nuclear receptor subfamily 2, group E, member 3 (NR2E3)
IC50
4415±n/a nM
Citation
 PubChem, PC Counterscreen for agonists of nuclear receptor subfamily 2, group E, member 3 (NR2E3): TR-FRET-based biochemical high throughput dose response assay to identify agonists of the interaction between peroxisome proliferator-activated receptor gamma (PPARg) and nuclear receptor co-repressor 2 (NCOR2) PubChem Bioassay (2010)[AID] 
Target
Name:
Isoform 2 of Nuclear receptor corepressor 2 (TRAC-1)
Synonyms:
CTG26 NCOR2_HUMAN nuclear receptor corepressor 2 isoform 2
Type:
Enzyme Catalytic Domain
Mol. Mass.:
81401.89
Organism:
Homo sapiens (Human)
Description:
Q9Y618-2 gi_116256445
Residue:
766
  
Inhibitor
Name:
BDBM44792
Synonyms:
2-[(5-cyano-4-keto-6-phenyl-1H-pyrimidin-2-yl)thio]-N-(5-methylisoxazol-3-yl)butyramide 2-[(5-cyano-4-oxo-6-phenyl-1H-pyrimidin-2-yl)sulfanyl]-N-(5-methyl-1,2-oxazol-3-yl)butanamide MLS000112466 cid_2915784
Type:
Small organic molecule
Emp. Form.:
C19H17N5O3S
Mol. Mass.:
395.435
SMILES:
CCC(Sc1nc(-c2ccccc2)c(C#N)c(=O)[nH]1)C(=O)Nc1cc(C)on1
: