Target
Isoform 2 of Nuclear receptor corepressor 2 (TRAC-1)
Ligand
BDBM66201
Substrate
Meas. Tech.
Counterscreen for agonists of nuclear receptor subfamily 2, group E, member 3 (NR2E3)
IC50
>39841±n/a nM
Citation
 PubChem, PC Counterscreen for agonists of nuclear receptor subfamily 2, group E, member 3 (NR2E3): TR-FRET-based biochemical high throughput dose response assay to identify agonists of the interaction between peroxisome proliferator-activated receptor gamma (PPARg) and nuclear receptor co-repressor 2 (NCOR2) PubChem Bioassay (2010)[AID] 
Target
Name:
Isoform 2 of Nuclear receptor corepressor 2 (TRAC-1)
Synonyms:
CTG26 NCOR2_HUMAN nuclear receptor corepressor 2 isoform 2
Type:
Enzyme Catalytic Domain
Mol. Mass.:
81401.89
Organism:
Homo sapiens (Human)
Description:
Q9Y618-2 gi_116256445
Residue:
766
  
Inhibitor
Name:
BDBM66201
Synonyms:
3-(2-chloranyl-6-fluoranyl-phenyl)-5-methyl-N-[5-(trifluoromethyl)-1,3,4-thiadiazol-2-yl]-1,2-oxazole-4-carboxamide 3-(2-chloro-6-fluorophenyl)-5-methyl-N-[5-(trifluoromethyl)-1,3,4-thiadiazol-2-yl]-1,2-oxazole-4-carboxamide MLS001035723 cid_1247739
Type:
Small organic molecule
Emp. Form.:
C14H7ClF4N4O2S
Mol. Mass.:
406.743
SMILES:
Cc1onc(c1C(=O)Nc1nnc(s1)C(F)(F)F)-c1c(F)cccc1Cl
: