Target
Isoform 2 of Nuclear receptor corepressor 2 (TRAC-1)
Ligand
BDBM66213
Substrate
Meas. Tech.
Counterscreen for agonists of nuclear receptor subfamily 2, group E, member 3 (NR2E3)
IC50
2361±n/a nM
Citation
 PubChem, PC Counterscreen for agonists of nuclear receptor subfamily 2, group E, member 3 (NR2E3): TR-FRET-based biochemical high throughput dose response assay to identify agonists of the interaction between peroxisome proliferator-activated receptor gamma (PPARg) and nuclear receptor co-repressor 2 (NCOR2) PubChem Bioassay (2010)[AID] 
Target
Name:
Isoform 2 of Nuclear receptor corepressor 2 (TRAC-1)
Synonyms:
CTG26 NCOR2_HUMAN nuclear receptor corepressor 2 isoform 2
Type:
Enzyme Catalytic Domain
Mol. Mass.:
81401.89
Organism:
Homo sapiens (Human)
Description:
Q9Y618-2 gi_116256445
Residue:
766
  
Inhibitor
Name:
BDBM66213
Synonyms:
3-(1-benzofuran-2-carbonyl)-2-(3-bromophenyl)-4-hydroxy-1-(2-morpholin-4-ylethyl)-2H-pyrrol-5-one 3-[2-benzofuranyl(oxo)methyl]-2-(3-bromophenyl)-4-hydroxy-1-[2-(4-morpholinyl)ethyl]-2H-pyrrol-5-one MLS001146404 cid_3802907
Type:
Small organic molecule
Emp. Form.:
C25H23BrN2O5
Mol. Mass.:
511.365
SMILES:
Brc1cccc(c1)C1C(C(=O)c2cc3ccccc3o2)C(=O)C(=O)N1CCN1CCOCC1
: