Target
Bcl-2-like protein 11
Ligand
BDBM66274
Substrate
Meas. Tech.
Luminescence Cell-Based Dose Retest to Identify Inhibitors of A1 Apoptosis
EC50
60410±n/a nM
Citation
 PubChem, PC Luminescence Cell-Based Dose Retest to Identify Inhibitors of A1 Apoptosis PubChem Bioassay (2010)[AID] 
Target
Name:
Bcl-2-like protein 11
Synonyms:
B2L11_HUMAN BCL2L11 | BIM
Type:
PROTEIN
Mol. Mass.:
22175.26
Organism:
Homo sapiens (Human)
Description:
EBI_101325
Residue:
198
  
Inhibitor
Name:
BDBM66274
Synonyms:
3-ethoxy-N-[3-[5-(4-methylphenyl)-1,3,4-oxadiazol-2-yl]phenyl]benzamide 3-ethoxy-N-{3-[5-(4-methylphenyl)-1,3,4-oxadiazol-2-yl]phenyl}benzamide SMR000081011 | cid_1026625
Type:
Small organic molecule
Emp. Form.:
C24H21N3O3
Mol. Mass.:
399.4418
SMILES:
CCOc1cccc(c1)C(=O)Nc1cccc(c1)-c1nnc(o1)-c1ccc(C)cc1
: