Target
Bcl-2-like protein 11
Ligand
BDBM50042944
Substrate
Meas. Tech.
Luminescence Cell-Based Dose Retest to Identify Inhibitors of A1 Apoptosis
EC50
>350000±n/a nM
Citation
 PubChem, PC Luminescence Cell-Based Dose Retest to Identify Inhibitors of A1 Apoptosis PubChem Bioassay (2010)[AID] 
Target
Name:
Bcl-2-like protein 11
Synonyms:
B2L11_HUMAN BCL2L11 | BIM
Type:
PROTEIN
Mol. Mass.:
22175.26
Organism:
Homo sapiens (Human)
Description:
EBI_101325
Residue:
198
  
Inhibitor
Name:
BDBM50042944
Synonyms:
(E)-1-(2,4-Dihydroxy-phenyl)-3-(4-hydroxy-phenyl)-propenone 1-(2,4-Dihydroxy-phenyl)-3-(4-hydroxy-phenyl)-propenone 1-(2,4-dihydroxyphenyl)-3-(4-hydroxyphenyl)prop-2-en-1-one 2',4,4'-trihydroxychalcone CHEMBL129795 cid_638278
Type:
Small organic molecule
Emp. Form.:
C15H12O4
Mol. Mass.:
256.2534
SMILES:
Oc1ccc(\C=C\C(=O)c2ccc(O)cc2O)cc1
: