Target
Bcl-2-like protein 11
Ligand
BDBM66356
Substrate
Meas. Tech.
Luminescence Cell-Based Dose Retest to Identify Inhibitors of A1 Apoptosis
EC50
>350000±n/a nM
Citation
 PubChem, PC Luminescence Cell-Based Dose Retest to Identify Inhibitors of A1 Apoptosis PubChem Bioassay (2010)[AID] 
Target
Name:
Bcl-2-like protein 11
Synonyms:
B2L11_HUMAN BCL2L11 | BIM
Type:
PROTEIN
Mol. Mass.:
22175.26
Organism:
Homo sapiens (Human)
Description:
EBI_101325
Residue:
198
  
Inhibitor
Name:
BDBM66356
Synonyms:
4-[[[(2S)-2-(4-keto-1,2,3-benzotriazin-3-yl)-3-methyl-pentanoyl]amino]methyl]cyclohexanecarboxylic acid 4-[[[(2S)-3-methyl-2-(4-oxidanylidene-1,2,3-benzotriazin-3-yl)pentanoyl]amino]methyl]cyclohexane-1-carboxylic acid 4-{[(S)-3-Methyl-2-(4-oxo-4H-benzo[d][1,2,3]triazin-3-yl)-pentanoylamino]-methyl}-cyclohexanecarboxyli c acid SMR000145078 | cid_9551690
Type:
Small organic molecule
Emp. Form.:
C21H28N4O4
Mol. Mass.:
400.4714
SMILES:
CCC(C)[C@@H](C(=O)NCC1CCC(CC1)C(O)=O)n1nnc2ccccc2c1=O
: