Target
Bcl-2-like protein 11
Ligand
BDBM31013
Substrate
Meas. Tech.
Luminescence Cell-Based Dose Retest to Identify Inhibitors of A1 Apoptosis
EC50
>350000±n/a nM
Citation
 PubChem, PC Luminescence Cell-Based Dose Retest to Identify Inhibitors of A1 Apoptosis PubChem Bioassay (2010)[AID] 
Target
Name:
Bcl-2-like protein 11
Synonyms:
B2L11_HUMAN BCL2L11 | BIM
Type:
PROTEIN
Mol. Mass.:
22175.26
Organism:
Homo sapiens (Human)
Description:
EBI_101325
Residue:
198
  
Inhibitor
Name:
BDBM31013
Synonyms:
4-[(3,5-dimethyl-4-isoxazolyl)methoxy]benzoic acid [1-[4-(4-morpholinyl)anilino]-1-oxopropan-2-yl] ester MLS000056068 [1-(4-morpholin-4-ylanilino)-1-oxopropan-2-yl] 4-[(3,5-dimethyl-1,2-oxazol-4-yl)methoxy]benzoate cid_2998209
Type:
Small organic molecule
Emp. Form.:
C26H29N3O6
Mol. Mass.:
479.525
SMILES:
CC(OC(=O)c1ccc(OCc2c(C)noc2C)cc1)C(=O)Nc1ccc(cc1)N1CCOCC1
: