Target
Bcl-2-like protein 11
Ligand
BDBM67050
Substrate
Meas. Tech.
Luminescence Cell-Based Dose Retest to Identify Inhibitors of A1 Apoptosis
EC50
>350000±n/a nM
Citation
 PubChem, PC Luminescence Cell-Based Dose Retest to Identify Inhibitors of A1 Apoptosis PubChem Bioassay (2010)[AID] 
Target
Name:
Bcl-2-like protein 11
Synonyms:
B2L11_HUMAN BCL2L11 | BIM
Type:
PROTEIN
Mol. Mass.:
22175.26
Organism:
Homo sapiens (Human)
Description:
EBI_101325
Residue:
198
  
Inhibitor
Name:
BDBM67050
Synonyms:
4-[(4-ethoxyphenoxy)methyl]-N'-[(Z)-2-pyrrolylidenemethyl]benzohydrazide MLS002245189 cid_42912529
Type:
Small organic molecule
Emp. Form.:
C21H21N3O3
Mol. Mass.:
363.4097
SMILES:
CCOc1ccc(OCc2ccc(cc2)C(=O)NN=Cc2ccc[nH]2)cc1
: