Target
Bcl-2-like protein 11
Ligand
BDBM67062
Substrate
Meas. Tech.
Luminescence Cell-Based Dose Retest to Identify Inhibitors of A1 Apoptosis
EC50
>350000±n/a nM
Citation
 PubChem, PC Luminescence Cell-Based Dose Retest to Identify Inhibitors of A1 Apoptosis PubChem Bioassay (2010)[AID] 
Target
Name:
Bcl-2-like protein 11
Synonyms:
B2L11_HUMAN BCL2L11 | BIM
Type:
PROTEIN
Mol. Mass.:
22175.26
Organism:
Homo sapiens (Human)
Description:
EBI_101325
Residue:
198
  
Inhibitor
Name:
BDBM67062
Synonyms:
MLS002473773 N-[(2S,3S)-2-[[cyclohexylmethyl(methyl)amino]methyl]-5-[(1R)-2-hydroxy-1-methyl-ethyl]-6-keto-3-methyl-3,4-dihydro-2H-1,5-benzoxazocin-10-yl]thiophene-2-sulfonamide N-[(2S,3S)-2-[[cyclohexylmethyl(methyl)amino]methyl]-5-[(2R)-1-hydroxypropan-2-yl]-3-methyl-6-oxo-3,4-dihydro-2H-1,5-benzoxazocin-10-yl]thiophene-2-sulfonamide cid_44202396
Type:
Small organic molecule
Emp. Form.:
C27H39N3O5S2
Mol. Mass.:
549.746
SMILES:
C[C@H](CO)N1C[C@H](C)[C@@H](CN(C)CC2CCCCC2)Oc2c(NS(=O)(=O)c3cccs3)cccc2C1=O
: