Target
Bcl-2-like protein 11
Ligand
BDBM67072
Substrate
Meas. Tech.
Luminescence Cell-Based Dose Retest to Identify Inhibitors of A1 Apoptosis
EC50
>350000±n/a nM
Citation
 PubChem, PC Luminescence Cell-Based Dose Retest to Identify Inhibitors of A1 Apoptosis PubChem Bioassay (2010)[AID] 
Target
Name:
Bcl-2-like protein 11
Synonyms:
B2L11_HUMAN BCL2L11 | BIM
Type:
PROTEIN
Mol. Mass.:
22175.26
Organism:
Homo sapiens (Human)
Description:
EBI_101325
Residue:
198
  
Inhibitor
Name:
BDBM67072
Synonyms:
2-[4-[(4-chlorophenyl)sulfonyl-methyl-amino]phenoxy]-N-(4-hydroxycyclohexyl)acetamide 2-[4-[(4-chlorophenyl)sulfonyl-methylamino]phenoxy]-N-(4-hydroxycyclohexyl)acetamide SMR001315997 | cid_2373156
Type:
Small organic molecule
Emp. Form.:
C21H25ClN2O5S
Mol. Mass.:
452.952
SMILES:
CN(c1ccc(OCC(=O)NC2CCC(O)CC2)cc1)S(=O)(=O)c1ccc(Cl)cc1
: