Target
Gag-Pol polyprotein [588-1027,K690N]/[588-1147,K690N]
Ligand
BDBM2483
Substrate
poly(rC)-oligo(dG)(12-18)
Meas. Tech.
HIV-1 RT Assay
pH
7.8±n/a
Temperature
310.15±n/a K
IC50
3400±300 nM
Citation
 Silvestri, RDe Martino, GLa Regina, GArtico, MMassa, SVargiu, LMura, MLoi, AGMarceddu, TLa Colla, P Novel indolyl aryl sulfones active against HIV-1 carrying NNRTI resistance mutations: synthesis and SAR studies. J Med Chem 46:2482-93 (2003)  
Target
Name:
Gag-Pol polyprotein [588-1027,K690N]/[588-1147,K690N]
Synonyms:
EC: 2.7.7.49 | HIV-1 Reverse Transcriptase Mutant (K103N)
Type:
Protein Complex
Mol. Mass.:
Description:
Components:
This complex has 2 components.
Component 1
Name:
Gag-Pol polyprotein [588-1147,K690N]
Synonyms:
HIV-1 Reverse Transcriptase Mutant (K103N) Chain A gag-pol
Type:
Enzyme Subunit
Mol. Mass.:
64471.33
Organism:
Human immunodeficiency virus type 1
Description:
P04585[588-1147,K690N]
Residue:
560
  
Component 2
Name:
Gag-Pol polyprotein [588-1027,K690N]
Synonyms:
HIV-1 Reverse Transcriptase Mutant (K103N) Chain B gag-pol
Type:
Enzyme Subunit
Mol. Mass.:
51280.01
Organism:
Human immunodeficiency virus type 1
Description:
P04585[588-1027,K690N]
Residue:
440
  
Inhibitor
Name:
BDBM2483
Synonyms:
(4S)-6-chloro-4-(2-cyclopropylethynyl)-4-(trifluoromethyl)-2,4-dihydro-1H-3,1-benzoxazin-2-one DMP-266 Efavirenz L-743,726 | Sustiva
Type:
Small organic molecule
Emp. Form.:
C14H9ClF3NO2
Mol. Mass.:
315.675
SMILES:
FC(F)(F)[C@]1(OC(=O)Nc2ccc(Cl)cc12)C#CC1CC1
:
Substrate
Name:
poly(rC)-oligo(dG)(12-18)
Synonyms:
Type:
RNA/DNA duplex
Mol. Mass.:
358.43
Organism:
Description:
The incorporation of Tritium-labeled dGTP onto a poly(rC)-oligo(dG)(12-18) template-primer
Residue:
3
NA