Target
Signal transducer and activator of transcription 1-alpha/beta
Ligand
BDBM67105
Substrate
Meas. Tech.
Late stage results from the probe development effort to identify STAT1 inhibitors: luminescence-based cell-based dose response assay for STAT1 inhibitors
IC50
>55690±n/a nM
Citation
 PubChem, PC Late stage results from the probe development effort to identify STAT1 inhibitors: luminescence-based cell-based dose response assay for STAT1 inhibitors PubChem Bioassay (2010)[AID] 
Target
Name:
Signal transducer and activator of transcription 1-alpha/beta
Synonyms:
STAT1 Signal transducer and activator of transcription 1-alpha/beta Transcription factor ISGF-3 components p91/p84 | signal transducer and activator of transcription 1 isoform alpha
Type:
Cytosolic Transcription Factor
Mol. Mass.:
87327.69
Organism:
Homo sapiens (Human)
Description:
Stat1 was expressed in sf9 cells from a baculovirus encoding the recombinant proteins. Stat1 dimer binds to DNA.
Residue:
750
  
Inhibitor
Name:
BDBM67105
Synonyms:
2-[4-(2,3-dihydro-1,4-benzodioxin-6-ylsulfonyl)-1-piperazinyl]-N-(4-fluorophenyl)-2-phenylacetamide 2-[4-(2,3-dihydro-1,4-benzodioxin-6-ylsulfonyl)piperazin-1-yl]-N-(4-fluorophenyl)-2-phenylacetamide SR-03000000774-1 | cid_4965796
Type:
Small organic molecule
Emp. Form.:
C26H26FN3O5S
Mol. Mass.:
511.565
SMILES:
Fc1ccc(NC(=O)C(N2CCN(CC2)S(=O)(=O)c2ccc3OCCOc3c2)c2ccccc2)cc1
: