Target
Signal transducer and activator of transcription 1-alpha/beta
Ligand
BDBM67119
Substrate
Meas. Tech.
Late stage results from the probe development effort to identify STAT1 inhibitors: luminescence-based cell-based dose response assay for STAT1 inhibitors
IC50
>55690±n/a nM
Citation
 PubChem, PC Late stage results from the probe development effort to identify STAT1 inhibitors: luminescence-based cell-based dose response assay for STAT1 inhibitors PubChem Bioassay (2010)[AID] 
Target
Name:
Signal transducer and activator of transcription 1-alpha/beta
Synonyms:
STAT1 Signal transducer and activator of transcription 1-alpha/beta Transcription factor ISGF-3 components p91/p84 | signal transducer and activator of transcription 1 isoform alpha
Type:
Cytosolic Transcription Factor
Mol. Mass.:
87327.69
Organism:
Homo sapiens (Human)
Description:
Stat1 was expressed in sf9 cells from a baculovirus encoding the recombinant proteins. Stat1 dimer binds to DNA.
Residue:
750
  
Inhibitor
Name:
BDBM67119
Synonyms:
2-(4-indan-5-ylsulfonylpiperazino)-N-phenyl-butyramide 2-[4-(2,3-dihydro-1H-inden-5-ylsulfonyl)piperazin-1-yl]-N-phenyl-butanamide SR-03000000788-1 | cid_17498738
Type:
Small organic molecule
Emp. Form.:
C23H29N3O3S
Mol. Mass.:
427.56
SMILES:
CCC(N1CCN(CC1)S(=O)(=O)c1ccc2CCCc2c1)C(=O)Nc1ccccc1
: