Target
Apelin receptor
Ligand
BDBM19164
Substrate
Meas. Tech.
Dose Response confirmation of uHTS hits from a small molecule antagonists of the APJ receptor via a luminescent beta-arrestin assay
IC50
1050±n/a nM
Citation
 PubChem, PC Dose Response confirmation of uHTS hits from a small molecule antagonists of the APJ receptor via a luminescent beta-arrestin assay PubChem Bioassay (2010)[AID] 
Target
Name:
Apelin receptor
Synonyms:
AGTRL1 APJ_HUMAN Angiotensin receptor-like 1 Apelin receptor (APJ) G-protein coupled receptor HG11
Type:
Enzyme Catalytic Domain
Mol. Mass.:
42664.06
Organism:
Homo sapiens (Human)
Description:
P35414
Residue:
380
  
Inhibitor
Name:
BDBM19164
Synonyms:
3-phenyl-5H-indeno[1,2-c]pyridazin-5-one CHEMBL421088 | cid_379337
Type:
Small organic molecule
Emp. Form.:
C17H10N2O
Mol. Mass.:
258.2741
SMILES:
O=C1c2ccccc2-c2nnc(cc12)-c1ccccc1
: