Target
Apelin receptor
Ligand
BDBM21618
Substrate
Meas. Tech.
Dose Response confirmation of uHTS hits from a small molecule antagonists of the APJ receptor via a luminescent beta-arrestin assay
IC50
3130±n/a nM
Citation
 PubChem, PC Dose Response confirmation of uHTS hits from a small molecule antagonists of the APJ receptor via a luminescent beta-arrestin assay PubChem Bioassay (2010)[AID] 
Target
Name:
Apelin receptor
Synonyms:
AGTRL1 APJ_HUMAN Angiotensin receptor-like 1 Apelin receptor (APJ) G-protein coupled receptor HG11
Type:
Enzyme Catalytic Domain
Mol. Mass.:
42664.06
Organism:
Homo sapiens (Human)
Description:
P35414
Residue:
380
  
Inhibitor
Name:
BDBM21618
Synonyms:
3-(4-methoxyphenyl)-5H-indeno[1,2-c]pyridazin-5-one Indeno[1,2-c]pyridazin-5-one, 6 | cid_379338
Type:
Small organic molecule
Emp. Form.:
C18H12N2O2
Mol. Mass.:
288.3001
SMILES:
COc1ccc(cc1)-c1cc2C(=O)c3ccccc3-c2nn1
: