Target
Apelin receptor
Ligand
BDBM67328
Substrate
Meas. Tech.
Dose Response confirmation of uHTS hits from a small molecule antagonists of the APJ receptor via a luminescent beta-arrestin assay
IC50
3550±n/a nM
Citation
 PubChem, PC Dose Response confirmation of uHTS hits from a small molecule antagonists of the APJ receptor via a luminescent beta-arrestin assay PubChem Bioassay (2010)[AID] 
Target
Name:
Apelin receptor
Synonyms:
AGTRL1 APJ_HUMAN Angiotensin receptor-like 1 Apelin receptor (APJ) G-protein coupled receptor HG11
Type:
Enzyme Catalytic Domain
Mol. Mass.:
42664.06
Organism:
Homo sapiens (Human)
Description:
P35414
Residue:
380
  
Inhibitor
Name:
BDBM67328
Synonyms:
3-(4-Acetyl-phenylimino)-1,3-dihydro-indol-2-one 3-(4-acetylanilino)indol-2-one MLS001212461 cid_326793
Type:
Small organic molecule
Emp. Form.:
C16H12N2O2
Mol. Mass.:
264.2787
SMILES:
CC(=O)c1ccc(NC2=c3ccccc3=NC2=O)cc1
: