Target
Nucleotide-binding oligomerization domain-containing protein 1
Ligand
BDBM67398
Substrate
Meas. Tech.
SAR analysis of compounds that inhibit NOD1 - Set 3
IC50
>20000±n/a nM
Citation
 PubChem, PC SAR analysis of compounds that inhibit NOD1 - Set 3 PubChem Bioassay (2010)[AID] 
Target
Name:
Nucleotide-binding oligomerization domain-containing protein 1
Synonyms:
CARD4 NOD1_HUMAN | nucleotide-binding oligomerization domain containing 1
Type:
Enzyme Catalytic Domain
Mol. Mass.:
107699.03
Organism:
Homo sapiens (Human)
Description:
gi_5174617
Residue:
953
  
Inhibitor
Name:
BDBM67398
Synonyms:
5-(3,4-dimethoxyphenyl)-2-(4-fluorophenyl)sulfonyl-3-pyrazolamine 5-(3,4-dimethoxyphenyl)-2-(4-fluorophenyl)sulfonylpyrazol-3-amine [5-(3,4-dimethoxyphenyl)-2-(4-fluorophenyl)sulfonyl-pyrazol-3-yl]amine | cid_9551529
Type:
Small organic molecule
Emp. Form.:
C17H16FN3O4S
Mol. Mass.:
377.39
SMILES:
COc1ccc(cc1OC)-c1cc(N)n(n1)S(=O)(=O)c1ccc(F)cc1
: