Target
Nucleotide-binding oligomerization domain-containing protein 2
Ligand
BDBM39126
Substrate
Meas. Tech.
SAR analysis of compounds that inhibit NOD2 - Set 3
IC50
>20000±n/a nM
Citation
 PubChem, PC SAR analysis of compounds that inhibit NOD2 - Set 3 PubChem Bioassay (2010)[AID] 
Target
Name:
Nucleotide-binding oligomerization domain-containing protein 2
Synonyms:
CARD15 IBD1 NOD2 Nucleotide-binding oligomerization domain-containing protein 2 | nucleotide-binding oligomerization domain containing 2
Type:
PROTEIN
Mol. Mass.:
115287.18
Organism:
Homo sapiens (Human)
Description:
ChEMBL_1454053
Residue:
1040
  
Inhibitor
Name:
BDBM39126
Synonyms:
2-(2,3,4,5,6-pentafluorophenyl)sulfonyl-5-phenyl-3-pyrazolamine 2-[2,3,4,5,6-pentakis(fluoranyl)phenyl]sulfonyl-5-phenyl-pyrazol-3-amine [2-(2,3,4,5,6-pentafluorophenyl)sulfonyl-5-phenyl-pyrazol-3-yl]amine | cid_16654628
Type:
Small organic molecule
Emp. Form.:
C15H8F5N3O2S
Mol. Mass.:
389.3
SMILES:
Nc1cc(nn1S(=O)(=O)c1c(F)c(F)c(F)c(F)c1F)-c1ccccc1
: