Target
Nucleotide-binding oligomerization domain-containing protein 2
Ligand
BDBM59542
Substrate
Meas. Tech.
SAR analysis of compounds that inhibit NOD2 - Set 3
IC50
>20000±n/a nM
Citation
 PubChem, PC SAR analysis of compounds that inhibit NOD2 - Set 3 PubChem Bioassay (2010)[AID] 
Target
Name:
Nucleotide-binding oligomerization domain-containing protein 2
Synonyms:
CARD15 IBD1 NOD2 Nucleotide-binding oligomerization domain-containing protein 2 | nucleotide-binding oligomerization domain containing 2
Type:
PROTEIN
Mol. Mass.:
115287.18
Organism:
Homo sapiens (Human)
Description:
ChEMBL_1454053
Residue:
1040
  
Inhibitor
Name:
BDBM59542
Synonyms:
(1-tosylbenzimidazol-2-yl)amine 1-(4-methylphenyl)sulfonylbenzimidazol-2-amine MLS001201458 cid_1088438
Type:
Small organic molecule
Emp. Form.:
C14H13N3O2S
Mol. Mass.:
287.337
SMILES:
Cc1ccc(cc1)S(=O)(=O)n1c(N)nc2ccccc12
: