Target
Lysine-specific histone demethylase 1A [151-852]
Ligand
BDBM103884
Substrate
Meas. Tech.
Demethylase Biochemical Assay
pH
7.5±n/a
Temperature
298.15±n/a K
IC50
<50±n/a nM
Comments
extracted
Citation
 Wu, LWang, XYao, WZhang, C Substituted triazolo[1,5-a]pyridines and triazolo[1,5-a]pyrazines as LSD1 inhibitors US Patent  US9695167 Publication Date 7/4/2017 
Target
Name:
Lysine-specific histone demethylase 1A [151-852]
Synonyms:
AOF2 KDM1A KIAA0601 Lysine-specific histone demethylase 1A
Type:
Mol. Mass.:
77867.68
Organism:
Homo sapiens (Human)
Description:
ENZO (BML-SE544-0050) which consists of 151-852 aa
Residue:
702
  
Inhibitor
Name:
BDBM103884
Synonyms:
US10125133, Example 11 US9695167, 11
Type:
Small organic molecule
Emp. Form.:
C26H26N6
Mol. Mass.:
422.5248
SMILES:
CN[C@@H]1CCN(Cc2cc(-c3ccc(cc3)C#N)c(-c3ccc(C)cc3)n3ncnc23)C1
: