Target
NADPH oxidase 1
Ligand
BDBM50097447
Substrate
Meas. Tech.
Late-stage luminescence-based cell-based dose response assay to identify inhibitors of NADPH oxidase 1 (NOX1): Purchased analogs
IC50
>17000±n/a nM
Citation
 PubChem, PC Late-stage luminescence-based cell-based dose response assay to identify inhibitors of NADPH oxidase 1 (NOX1): Purchased analogs PubChem Bioassay (2010)[AID] 
Target
Name:
NADPH oxidase 1
Synonyms:
MOX-1 Mitogenic oxidase 1 NOH-1 NOX-1 NOX1_HUMAN
Type:
PROTEIN
Mol. Mass.:
64890.44
Organism:
Homo sapiens (Human)
Description:
ChEMBL_792877
Residue:
564
  
Inhibitor
Name:
BDBM50097447
Synonyms:
1-Phenyl-3-(4-phenyl-thiazol-2-yl)-urea cid_832542
Type:
Small organic molecule
Emp. Form.:
C16H13N3OS
Mol. Mass.:
295.359
SMILES:
O=C(Nc1nc(cs1)-c1ccccc1)Nc1ccccc1
: