Target
NADPH oxidase 1
Ligand
BDBM67473
Substrate
Meas. Tech.
Late-stage luminescence-based cell-based dose response assay to identify inhibitors of NADPH oxidase 1 (NOX1): Purchased analogs
IC50
>17000±n/a nM
Citation
 PubChem, PC Late-stage luminescence-based cell-based dose response assay to identify inhibitors of NADPH oxidase 1 (NOX1): Purchased analogs PubChem Bioassay (2010)[AID] 
Target
Name:
NADPH oxidase 1
Synonyms:
MOX-1 Mitogenic oxidase 1 NOH-1 NOX-1 NOX1_HUMAN
Type:
PROTEIN
Mol. Mass.:
64890.44
Organism:
Homo sapiens (Human)
Description:
ChEMBL_792877
Residue:
564
  
Inhibitor
Name:
BDBM67473
Synonyms:
3-chloranyl-1-benzothiophene-2-carboxylic acid 3-chlorobenzothiophene-2-carboxylic acid cid_307964
Type:
Small organic molecule
Emp. Form.:
C9H5ClO2S
Mol. Mass.:
212.653
SMILES:
OC(=O)c1sc2ccccc2c1Cl
: