Target
NADPH oxidase 1
Ligand
BDBM67532
Substrate
Meas. Tech.
Late-stage luminescence-based cell-based dose response assay to identify inhibitors of NADPH oxidase 1 (NOX1): Purchased analogs
IC50
240.9±n/a nM
Citation
 PubChem, PC Late-stage luminescence-based cell-based dose response assay to identify inhibitors of NADPH oxidase 1 (NOX1): Purchased analogs PubChem Bioassay (2010)[AID] 
Target
Name:
NADPH oxidase 1
Synonyms:
MOX-1 Mitogenic oxidase 1 NOH-1 NOX-1 NOX1_HUMAN
Type:
PROTEIN
Mol. Mass.:
64890.44
Organism:
Homo sapiens (Human)
Description:
ChEMBL_792877
Residue:
564
  
Inhibitor
Name:
BDBM67532
Synonyms:
2-(methylthio)-10H-phenothiazine SR-03000000755-1 | cid_82096
Type:
Small organic molecule
Emp. Form.:
C13H11NS2
Mol. Mass.:
245.363
SMILES:
CSc1ccc2Sc3ccccc3Nc2c1
: