Target
NADPH oxidase 1
Ligand
BDBM67548
Substrate
Meas. Tech.
Late-stage luminescence-based cell-based dose response assay to identify inhibitors of NADPH oxidase 1 (NOX1): Purchased analogs 2
IC50
>17000±n/a nM
Citation
 PubChem, PC Late-stage luminescence-based cell-based dose response assay to identify inhibitors of NADPH oxidase 1 (NOX1): Purchased analogs 2 PubChem Bioassay (2010)[AID] 
Target
Name:
NADPH oxidase 1
Synonyms:
MOX-1 Mitogenic oxidase 1 NOH-1 NOX-1 NOX1_HUMAN
Type:
PROTEIN
Mol. Mass.:
64890.44
Organism:
Homo sapiens (Human)
Description:
ChEMBL_792877
Residue:
564
  
Inhibitor
Name:
BDBM67548
Synonyms:
2,4,6-trichloro-N-[(E)-(4-methoxyphenyl)methylideneamino]aniline SR-03000000882-1 cid_9626043
Type:
Small organic molecule
Emp. Form.:
C14H11Cl3N2O
Mol. Mass.:
329.609
SMILES:
COc1ccc(CN=Nc2c(Cl)cc(Cl)cc2Cl)cc1
: