Target
Serine/threonine-protein kinase 33
Ligand
BDBM50113745
Substrate
Meas. Tech.
Luminescence Cell-Free Homogenous Dose Retest to Identify Inhibitors of Serine/Threonine Kinase 33 Activity
EC50
1840±n/a nM
Citation
 PubChem, PC Luminescence Cell-Free Homogenous Dose Retest to Identify Inhibitors of Serine/Threonine Kinase 33 Activity PubChem Bioassay (2010)[AID] 
Target
Name:
Serine/threonine-protein kinase 33
Synonyms:
STK33 Serine/threonine-protein kinase 33
Type:
Enzyme Catalytic Domain
Mol. Mass.:
57833.21
Organism:
Homo sapiens (Human)
Description:
gi_23943882
Residue:
514
  
Inhibitor
Name:
BDBM50113745
Synonyms:
3-[6-(3-Chloro-phenylamino)-9-isopropyl-9H-purin-2-ylamino]-propan-1-ol cid_16746117
Type:
Small organic molecule
Emp. Form.:
C17H21ClN6O
Mol. Mass.:
360.841
SMILES:
CC(C)n1cnc2c(Nc3cccc(Cl)c3)nc(NCCCO)nc12
: