Target
DNA damage-inducible transcript 3 protein
Ligand
BDBM55139
Substrate
Meas. Tech.
Dose-response primary assay and counterscreen assay for HTS small molecule inhibitors of CHOP to regulate the unfolded protein response to ER stress
IC50
>10000±n/a nM
Citation
 PubChem, PC Dose-response primary assay and counterscreen assay for HTS small molecule inhibitors of CHOP to regulate the unfolded protein response to ER stress PubChem Bioassay (2010)[AID] 
Target
Name:
DNA damage-inducible transcript 3 protein
Synonyms:
Chop DDIT3_MOUSE Gadd153
Type:
Enzyme Catalytic Domain
Mol. Mass.:
19175.17
Organism:
Mus musculus
Description:
gi_160707929
Residue:
168
  
Inhibitor
Name:
BDBM55139
Synonyms:
(4Z)-4-[[3-(4-fluorophenyl)-1-phenyl-4-pyrazolyl]methylidene]-3-methyl-1H-pyrazol-5-one (4Z)-4-[[3-(4-fluorophenyl)-1-phenyl-pyrazol-4-yl]methylidene]-3-methyl-1H-pyrazol-5-one 4-{[3-(4-fluorophenyl)-1-phenyl-1H-pyrazol-4-yl]methylene}-5-methyl-2,4-dihydro-3H-pyrazol-3-one SMR000267633 | cid_5337366
Type:
Small organic molecule
Emp. Form.:
C20H15FN4O
Mol. Mass.:
346.3577
SMILES:
Fc1ccc(cc1)-c1nn(cc1C=c1c(=C)[nH][nH]c1=O)-c1ccccc1
: