Target
Tyrosine-protein kinase ABL1 [1-999,Q252H]
Ligand
BDBM50242740
Substrate
Meas. Tech.
Biochemcial Assay
pH
7.5±0
IC50
11±0.0 nM
Citation
 Okram, BNagle, AAdrián, FJLee, CRen, PWang, XSim, TXie, YWang, XXia, GSpraggon, GWarmuth, MLiu, YGray, NS A general strategy for creating "inactive-conformation" abl inhibitors. Chem Biol 13:779-86 (2006)  
Target
Name:
Tyrosine-protein kinase ABL1 [1-999,Q252H]
Synonyms:
ABL ABL1(Q252H) JTK7 Tyrosine-protein kinase ABL (dephosphorylated)
Type:
Enzyme Catalytic Domain
Mol. Mass.:
108590.01
Organism:
Homo sapiens (Human)
Description:
gi_62362414
Residue:
999
  
Inhibitor
Name:
BDBM50242740
Synonyms:
CHEMBL459850 Type II inhibitor, 14
Type:
Small organic molecule
Emp. Form.:
C22H19F3N6O2
Mol. Mass.:
456.4205
SMILES:
CN1C(=O)N(Cc2cnc(N)nc12)c1cc(NC(=O)c2cccc(c2)C(F)(F)F)ccc1C
: