Target
UDP-galactopyranose mutase
Ligand
BDBM68236
Substrate
Meas. Tech.
High-throughput FP Assay
Kd
>1.12e+4±n/a nM
Citation
 Carlson, EEMay, JFKiessling, LL Chemical probes of UDP-galactopyranose mutase. Chem Biol 13:825-37 (2006)  
Target
Name:
UDP-galactopyranose mutase
Synonyms:
Type:
Protein
Mol. Mass.:
44526.00
Organism:
Klebsiella pneumoniae
Description:
Q762K7
Residue:
384
  
Inhibitor
Name:
BDBM68236
Synonyms:
Thiazolidinone core, 17
Type:
Small organic molecule
Emp. Form.:
C19H14BrNO4S2
Mol. Mass.:
464.353
SMILES:
OC(=O)C(Cc1ccc(O)cc1)N1C(=S)S\C(=C\c2cccc(Br)c2)C1=O
: